{"text_format":"1","workbook":"xlsx","n_sheets":12,"sheets":["Tableau de bord","Décompte général","Amortissement","Tutoriel","Ressources",">>>","<<<","Informations oeuvre","Base de données ayants droit","Matrice décompte auteur.e","Matrice décompte RNPP","Matrice décompte amortissement"],"not_rendered":{"charts":0,"images":10,"macros":1,"external_links":0,"defined_names":22,"comments":0,"pivot_tables":0},"unopened":[],"bounds":{"document_bytes":16777216,"sheet_cells":100000,"rows_first":2000,"rows_last":500,"rows_between":2000,"halvings":0,"cell_chars":16384,"cell_head_chars":4096},"cells_cut":0,"cells_raw":0,"read":"whole","date_system":"1900"}

{"sheet":"Tableau de bord","index":0,"n_rows":19,"n_cols":11,"rows_kept":19,"cut":false,"hidden":false,"merged":[]}
[]
[]
[]
[]
[]
[null,null,null,null,"\n"]
[]
[]
[]
[]
[]
[]
[]
[null,null,null,null,null,null,null,null,null,null,0]
[null,null,null,null,null,null,null,null,null,null,"2025-12-31"]
[]
[]
[]
[null,false]

{"sheet":"Décompte général","index":1,"n_rows":124,"n_cols":18,"rows_kept":124,"cut":false,"hidden":false,"merged":[]}
[]
[]
[]
[]
[]
[null,null,null,null,null,null,null,null,null,null,null,null,"LÉGENDE DES COULEURS DE REMPLISSAGE"]
[null,{"$f":"'Informations oeuvre'!C2","v":"ŒUVRE"},null,null,null,null,null,null,null,{"$f":"\"Période arrétée au : \"&TEXT('Informations oeuvre'!C10,\"jj/mm/aaaa\")","v":"Période arrétée au : 31.12.2025"}]
[null,{"$f":"'Informations oeuvre'!C7","v":"[à compléter]"},null,null,null,null,null,null,null,null,null,null,2,"Variables à compléter à partir des relevés d'exploitation des mandataires, voir la section tutoriel pour plus de détail",null,null,"Variables à compléter à partir des relevés d'exploitation des mandataires, voir la section tutoriel pour plus de détail"]
[null,null,null,null,null,null,null,null,null,null,null,null,null,"Lignes qui concernent les auteur.e.s, voir la section tutoriel pour plus de détail",null,null,"Lignes qui concernent les auteur.e.s, voir la section tutoriel pour plus de détail"]
[]
[null,"RECETTES ISSUES DU PLAN DE FINANCEMENT"]
[null,"MINIMA GARANTIS SUR EXPLOITATION HORS GESTION COLLECTIVE"]
[null,null,"Mandataire","Territoire","Exploitation","Montant","Gestion individuelle"]
[null,null,"[à compléter]","[à compléter]","[à compléter]",0,0,null,null,{"$f":"+F14*G14","v":0}]
[null,null,"[à compléter]","[à compléter]","[à compléter]",0,0,null,null,{"$f":"F15*G15","v":0}]
[null,null,"RNPP-A sur minimas garantis",null,null,null,null,null,null,{"$f":"+SUM(J14:J15)","v":0}]
[]
[null,"PREVENTES INTERNATIONAL"]
[null,null,"Acheteur","Territoire","Exploitation","Montant","Gestion individuelle"]
[null,null,"[à compléter]","[à compléter]","[à compléter]",0,0,null,null,{"$f":"+F20*G20","v":0}]
[null,null,"[à compléter]","[à compléter]","[à compléter]",0,0,null,null,{"$f":"F21*G21","v":0}]
[null,null,"Total encaissement brut",null,null,null,null,null,null,0]
[null,null,"Commission de distribution",null,null,null,0.3,null,null,{"$f":"J18*-G23","v":0}]
[null,null,"Frais d'exploitation usuels forfaitisés (5%)",null,null,null,null,null,null,{"$f":"J18*-5%","v":0}]
[null,null,"Frais d'exploitation non usuels (opposés au réel)",null,null,null,null,null,null,0]
[null,null,"RNPP-A sur préventes internationales",null,null,null,null,null,null,{"$f":"+SUM(J22:J25)","v":0}]
[]
[null,"COPRODUCTIONS INTERNATIONALES"]
[null,null,"Société","Territoire",null,"Apport","Gestion individuelle"]
[null,null,"[à compléter]","[à compléter]","[à compléter]",0,0,null,null,{"$f":"F30*G30","v":0}]
[null,null,"[à compléter]","[à compléter]","[à compléter]",0,0,null,null,{"$f":"F31*G31","v":0}]
[null,null,"Apports des coproducteurs considérés en RNPP-A forfaitaire",null,null,null,null,null,null,{"$f":"SUM(J30:J31)","v":0},null,null,"Dans ce cas, la part de recette du coproducteur étranger est à déduire des RNPP-A sur l'international"]
[]
[]
[null,"RECETTES ISSUES DE L'EXPLOITATION",null,null,null,null,null,"ANTÉRIEUR","PÉRIODE","CUMUL"]
[null,"1/ EXPLOITATION CINÉMA FRANCE",null,null,null,null,"[DISTRIBUTEUR]"]
[null,null,"Prix hors taxes (net de TVA et TSA) payé par le public ",null,null,null,null,0,{"$f":"J37-H37","v":0},0,null,null,"Dans la pratique, le prix public peut-être déterminé ur la base RBD x2"]
[]
[null,null,"Prix hors taxes (net de TVA et TSA) payé par le public jusqu'à amortissement",null,null,null,null,0,{"$f":"+J39-H39","v":0},0,null,null,"A compléter uniquement au moment du passage du point d'amortissement"]
[null,null,"Prix hors taxes (net de TVA et TSA) payé par le public après amortissement",null,null,null,null,0,{"$f":"J40-H40","v":0},{"$f":"J37-J39","v":0}]
{"$rows_left_out":85}
{"sheet":"Amortissement","index":2,"n_rows":86,"n_cols":12,"rows_kept":86,"cut":false,"hidden":false,"merged":[[42,2,42,5],[7,1,8,6],[12,2,12,5],[13,2,13,6],[18,2,18,5],[19,2,19,6],[24,2,24,5],[25,2,25,6],[30,2,30,5],[31,2,31,6],[36,2,36,5],[37,2,37,6],[43,2,43,6],[48,2,48,5],[49,2,49,6],[54,2,54,5],[55,2,55,6]]}
[]
[]
[]
[null,{"$f":"'Informations oeuvre'!C2","v":"ŒUVRE"},null,null,null,null,null,null,null,{"$f":"\"Période arrétée au : \"&TEXT('Informations oeuvre'!C10,\"jj/mm/aaaa\")","v":"Période arrétée au : 31.12.2025"}]
[null,{"$f":"+'Informations oeuvre'!C7","v":"[à compléter]"}]
[]
[null,"CALCUL DE L'AMORTISSEMENT DE L'ŒUVRE"]
[null,"Selon l'accord professionnel sur la transparence des comptes d'exploitation \ndes oeuvres audiovisuelles du 6 juillet 2017"]
[]
[null,null,null,null,null,null,null,"ANTÉRIEUR","PÉRIODE","CUMUL"]
[]
[null,null,"Recettes nettes par producteur Cinéma France après MG",null,null,null,null,0,{"$f":"+J12-H12","v":0},{"$f":"IF('Décompte général'!J47>0,'Décompte général'!J47,0)","v":0}]
[null,null,"Reversements aux préfinanceurs visés aux points d, e et/ou i \nde l'article 5.1 de l'accord du 19 février 2016*",null,null,null,null,0,{"$f":"J13-H13","v":0},0]
[null,null,"Reversement aux auteurs au titre de la rémunération proportionnelle",null,null,null,null,0,{"$f":"J14-H14","v":0},0]
[null,null,"Rémunération complémentaires aux artistes interprètes",null,null,null,null,0,{"$f":"J15-H15","v":0},0]
[null,"Recettes Cinéma France en amortissement du coût du film ",null,null,null,null,null,{"$f":"SUM(H12:H15)","v":0},{"$f":"SUM(I12:I15)","v":0},{"$f":"SUM(J12:J15)","v":0}]
[]
[null,null,"Recettes nettes par producteur Vidéo France après MG",null,null,null,null,0,{"$f":"+J18-H18","v":0},{"$f":"IF('Décompte général'!J60>0,'Décompte général'!J60,0)","v":0}]
[null,null,"Reversements aux préfinanceurs visés aux points d, e et/ou i \nde l'article 5.1 de l'accord du 19 février 2016*",null,null,null,null,0,{"$f":"J19-H19","v":0},0]
[null,null,"Reversement aux auteurs au titre de la rémunération proportionnelle",null,null,null,null,0,{"$f":"J20-H20","v":0},0]
[null,null,"Rémunération complémentaires aux artistes interprètes",null,null,null,null,0,{"$f":"J21-H21","v":0},0]
[null,"Recettes Vidéo France en amortissement du coût du film ",null,null,null,null,null,{"$f":"SUM(H18:H21)","v":0},{"$f":"SUM(I18:I21)","v":0},{"$f":"SUM(J18:J21)","v":0}]
[]
[null,null,"Recettes nettes par producteur VOD France après MG",null,null,null,null,0,{"$f":"+J24-H24","v":0},{"$f":"IF('Décompte général'!J70>0,'Décompte général'!J70,0)","v":0}]
[null,null,"Reversements aux préfinanceurs visés aux points d, e et/ou i \nde l'article 5.1 de l'accord du 19 février 2016*",null,null,null,null,0,{"$f":"J25-H25","v":0},0]
[null,null,"Reversement aux auteurs au titre de la rémunération proportionnelle",null,null,null,null,0,{"$f":"J26-H26","v":0},0]
[null,null,"Rémunération complémentaires aux artistes interprètes",null,null,null,null,0,{"$f":"J27-H27","v":0},0]
[null,"Recettes VOD France en amortissement du coût du film ",null,null,null,null,null,{"$f":"SUM(H24:H27)","v":0},{"$f":"SUM(I24:I27)","v":0},{"$f":"SUM(J24:J27)","v":0}]
[]
[null,null,"Recettes nettes par producteur TV France après MG",null,null,null,null,0,{"$f":"+J30-H30","v":0},{"$f":"IF('Décompte général'!J78>0,'Décompte général'!J78,0)","v":0}]
[null,null,"Reversements aux préfinanceurs visés aux points d, e et/ou i \nde l'article 5.1 de l'accord du 19 février 2016*",null,null,null,null,0,{"$f":"J31-H31","v":0},0]
[null,null,"Reversement aux auteurs au titre de la rémunération proportionnelle",null,null,null,null,0,{"$f":"J32-H32","v":0},0]
[null,null,"Rémunération complémentaires aux artistes interprètes",null,null,null,null,0,{"$f":"J33-H33","v":0},0]
[null,"Recettes TV France en amortissement du coût du film ",null,null,null,null,null,{"$f":"SUM(H30:H33)","v":0},{"$f":"SUM(I30:I33)","v":0},{"$f":"SUM(J30:J33)","v":0}]
[]
[null,null,"Recettes nettes par producteur SVOD France après MG",null,null,null,null,0,{"$f":"+J36-H36","v":0},{"$f":"IF('Décompte général'!J86>0,'Décompte général'!J86,0)","v":0}]
[null,null,"Reversements aux préfinanceurs visés aux points d, e et/ou i \nde l'article 5.1 de l'accord du 19 février 2016*",null,null,null,null,0,{"$f":"J37-H37","v":0},0]
[null,null,"Reversement aux auteurs au titre de la rémunération proportionnelle",null,null,null,null,0,{"$f":"J38-H38","v":0},0]
[null,null,"Rémunération complémentaires aux artistes interprètes",null,null,null,null,0,{"$f":"J39-H39","v":0},0]
[null,"Recettes SVOD France en amortissement du coût du film ",null,null,null,null,null,{"$f":"SUM(H36:H39)","v":0},{"$f":"SUM(I36:I39)","v":0},{"$f":"SUM(J36:J39)","v":0}]
{"$rows_left_out":47}
{"sheet":"Tutoriel","index":3,"n_rows":53,"n_cols":5,"rows_kept":53,"cut":false,"hidden":false,"merged":[]}
[]
[]
[]
[]
[]
[]
[]
[]
[]
[]
[]
[]
[]
[]
[]
[]
[]
[]
[]
[]
[]
[]
[]
[]
[]
[null,"SOMMAIRE"]
[]
[null,"     AVERTISSEMENT – CONDITIONS D’UTILISATION"]
[null,"     PRÉAMBULE : EXCEL VBA"]
[null,"     ÉTAPE 1 : INFORMATIONS DU FILM"]
[null,"     ÉTAPE 2 : LES AYANTS DROIT"]
[null,null,"2.1 Introduction"]
[null,null,"2.2 Ajouter un ayant droit"]
[null,null,null,"2.2.1 Cadre « Informations »"]
[null,null,"2.3 Modifier un ayant droit"]
[null,null,"2.4 Supprimer un ayant droit"]
[null,"     ÉTAPE 3 : LES DÉCOMPTES"]
[null,null,"3.1 Ajouter une base de décompte"]
[null,null,"3.2 Présentation des bases de décompte"]
[null,null,null,"3.2.1 Présentation du récapitulatif des droits (page 1)"]
{"$rows_left_out":14}
{"sheet":"Ressources","index":4,"n_rows":301,"n_cols":9,"rows_kept":301,"cut":false,"hidden":false,"merged":[[268,6,268,7],[257,6,257,7],[258,6,258,7],[259,6,259,7],[260,6,260,7],[261,6,261,7],[262,6,262,7],[263,6,263,7],[264,6,264,7],[265,6,265,7],[266,6,266,7],[267,6,267,7],[280,6,280,7],[269,6,269,7],[270,6,270,7],[271,6,271,7],[272,6,272,7],[273,6,273,7],[274,6,274,7],[275,6,275,7],[276,6,276,7],[277,6,277,7],[278,6,278,7],[279,6,279,7],[292,6,292,7],[281,6,281,7],[282,6,282,7],[283,6,283,7],[284,6,284,7],[285,6,285,7],[286,6,286,7],[287,6,287,7],[288,6,288,7],[289,6,289,7],[290,6,290,7],[291,6,291,7],[293,6,293,7],[294,6,294,7],[295,6,295,7],[296,6,296,7],[297,6,297,7]]}
[]
[]
[]
[]
[]
[]
[]
[]
[]
[]
[]
[]
[]
[]
[]
[]
[]
[]
[]
[]
[]
[]
[]
[]
[]
[]
[]
[]
[]
[]
[]
[]
[]
[]
[]
[]
[]
[]
[]
[]
{"$rows_left_out":262}
{"sheet":">>>","index":5,"n_rows":0,"n_cols":0,"rows_kept":0,"cut":false,"hidden":false,"merged":[]}

{"sheet":"<<<","index":6,"n_rows":0,"n_cols":0,"rows_kept":0,"cut":false,"hidden":false,"merged":[]}

{"sheet":"Informations oeuvre","index":7,"n_rows":11,"n_cols":3,"rows_kept":11,"cut":false,"hidden":false,"merged":[]}
[]
[null,"Titre ","ŒUVRE"]
[null,"Réalisation","[à compléter]"]
[null,"Format / Saison","[à compléter]"]
[null,"N°ISAN","[à compléter]"]
[null,"Production","[à compléter]"]
[null,"Adresse","[à compléter]"]
[null,"CP et ville","[à compléter]"]
[null,"Période",{"$f":"'Tableau de bord'!K15","v":"2025-12-31"}]
[null,null,{"$f":"TEXT(C9,\"j.M.aaaa\")","v":"31.12.2025"}]
[null,"N° Répartition",{"$f":"'Tableau de bord'!K14","v":0}]

{"sheet":"Base de données ayants droit","index":8,"n_rows":42,"n_cols":18,"rows_kept":42,"cut":false,"hidden":false,"merged":[]}
["#","NOM","Prénom","Qualité","Agence artistique","Adresse","Code postal et ville","Mail de contact 1","Mail de contact 2","Mail de contact 3","Mail de contact 4","Contrat signé le ","Avenant(s)","Identifiant",null,4,"AD3","Ne pas modifier"]
[{"$f":"N2","v":"AD1"},"EXEMPLE 1",null,"Coproducteur",null,"14 boulevard des Capucines","75009 PARIS","exemple1@mail.com","exemple1@mail.fr","exemple1@mail1.com","exemple1@mail1.fr","28/12/1895",true,"AD1"]
[{"$f":"N3","v":"AD2"},"EXEMPLE 2",null,"Auteur.e scénariste","Etoile","Sunset Boulevard","75009 Paris","exemple2@mail.com","exemple2@mail.fr","exemple2@mail2.com","exemple2@mail2.fr","18/04/1951",true,"AD2"]
[0]
[0]
[0]
[0]
[0]
[0]
[0]
[0]
[0]
[0]
[0]
[0]
[0]
[0]
[0]
[0]
[0]
[0]
[0]
[0]
[0]
[0]
[0]
[0]
[0]
[0]
[0]
[0]
[0]
[0]
[0]
[0]
[0]
[0]
[0]
[0]
[0]
{"$rows_left_out":3}
{"sheet":"Matrice décompte auteur.e","index":9,"n_rows":394,"n_cols":21,"rows_kept":394,"cut":false,"hidden":false,"merged":[[12,1,12,9],[1,1,1,4],[2,1,2,4],[3,1,3,4],[4,1,4,4],[11,1,11,9],[266,2,266,5],[13,1,13,9],[14,1,14,9],[238,1,239,6],[242,2,242,5],[243,2,243,6],[248,2,248,5],[249,2,249,6],[254,2,254,5],[255,2,255,6],[260,2,260,5],[261,2,261,6],[285,2,285,6],[267,2,267,6],[272,2,272,5],[273,2,273,6],[278,2,278,5],[279,2,279,6],[284,2,284,5]]}
[]
[null,"Expéditeur ",null,null,null,null,null,null,"Destinataire"]
[null,{"$f":"'Informations oeuvre'!C7","v":"[à compléter]"},null,null,null,null,null,null,{"$f":"N3&\" \"&+VLOOKUP($N$3,'Base de données ayants droit'!B:Y,2,FALSE)","v":"Exemple 2 "},null,null,null,"Ayant droit ","Exemple 2"]
[null,{"$f":"'Informations oeuvre'!C8","v":"[à compléter]"},null,null,null,null,null,null,{"$f":"+VLOOKUP($N$3,'Base de données ayants droit'!B:Y,5,FALSE)","v":"Sunset Boulevard"},null,null,null,"Ne pas modifier cette cellule"]
[null,{"$f":"'Informations oeuvre'!C9","v":"2025-12-31"},null,null,null,null,null,null,{"$f":"+VLOOKUP($N$3,'Base de données ayants droit'!B:Y,6,FALSE)","v":"75009 Paris"}]
[]
[null,{"$f":"'Informations oeuvre'!C2","v":"ŒUVRE"},null,null,null,null,null,{"$f":"\"DÉCOMPTE N°\"&'Informations oeuvre'!C11","v":"DÉCOMPTE N°0"}]
[null,{"$f":"\"Format / Saison : \"&'Informations oeuvre'!C4","v":"Format / Saison : [à compléter]"},null,null,null,null,null,{"$f":"\"Arrété au \"&TEXT('Informations oeuvre'!C10,\"jj/mm/aaaa\")","v":"Arrété au 31.12.2025"}]
[null,{"$f":"\"Réalisation : \"&'Informations oeuvre'!C3","v":"Réalisation : [à compléter]"}]
[null,{"$f":"\"N° ISAN : \"&'Informations oeuvre'!C5","v":"N° ISAN : [à compléter]"}]
[]
[null,{"$f":"+N3&\" \"&VLOOKUP(N3,'Base de données ayants droit'!B:Y,2, FALSE)","v":"Exemple 2 "}]
[null,{"$f":"\"Contrat \"&VLOOKUP(N3,'Base de données ayants droit'!B:Y,3,FALSE)","v":"Contrat Auteur.e scénariste"}]
[null,{"$f":"\"Signé en date du \"&TEXT(VLOOKUP(N3,'Base de données ayants droit'!B:W,11,FALSE),\"jj/mm/aa\")&IF(VLOOKUP(N3,'Base de données ayants droit'!B:W,12,FALSE)=TRUE,\" et son/ses avenant(s)\",\"\")","v":"Signé en date du 18/04/51 et son/ses avenant(s)"}]
[null,"[Cas échéant,  intitulé de l'épisode de l'auteur.e]",null,null,null,null,null,null,null,null,null,null,"Supprimer la ligne si non nécessaire"]
[]
[null,"RÉMUNÉRATION PROPORTIONNELLE",null,null,null,null,null,"BASE","%","QP"]
[]
[null,"1/ EXPLOITATION CINEMA France"]
[null,null,"Prix payé par le public net de taxes ",null,null,null,null,{"$f":"J109","v":0},0,{"$f":"+H20*I20","v":0}]
[]
[null,"2/ EXPLOITATION VIDEO France"]
[null,null,"Chiffre d'affaires net éditeur",null,null,null,null,{"$f":"J115","v":0},0,{"$f":"H23*I23","v":0},null,null,"Selon certaines conditions, l'exploitation vidéo peut-être prise en charge par les organismes de gestion collective"]
[]
[null,"3/ EXPLOITATION VOD France"]
[null,null,"Rémunération via organisme de gestion collective",null,null,null,null,"n/a",0]
[]
[null,"4/ EXPLOITATION TV France",null,null,null,null,{"$f":"+IF(VLOOKUP($N$3,'Base de données ayants droit'!B:Y,19,FALSE)=TRUE,\"Gestion collective\",\"\")","v":""}]
[null,null,"Rémunération via organisme de gestion collective",null,null,null,null,"n/a",0]
[]
[null,"5/ EXPLOITATION SVOD France"]
[null,null,"Rémunération via organisme de gestion collective",null,null,null,null,"n/a",0]
[]
[null,"6/ AUTRES EXPLOITATIONS France"]
[null,null,"Recettes nettes part producteur",null,null,null,null,{"$f":"IF(J136>0,J136,0)","v":0},0,{"$f":"H35*I35","v":0},null,null,"En cas de recettes sur l'exploitation littéraire, la base de recette est le prix payé par le public HT"]
[]
[null,"7/ EXPLOITATION VIDEO/VOD/TV/SVOD INTERNATIONALE"]
[null,null,"Minimum garanti",null,null,null,null,{"$f":"J86","v":0},0,{"$f":"H38*I38","v":0},null,null,"Le cas échéant, lier la base au minimum garanti du support approprié"]
[null,null,"Préventes",null,null,null,null,{"$f":"J98","v":0},0,{"$f":"H39*I39","v":0},null,null,"Le cas échéant, lier la base aux préventes du support approprié"]
[null,null,"RNPP-A forfaitaire en cas de coproduction internationale",null,null,null,null,{"$f":"J104","v":0},0]
{"$rows_left_out":355}
{"sheet":"Matrice décompte RNPP","index":10,"n_rows":154,"n_cols":14,"rows_kept":154,"cut":false,"hidden":false,"merged":[[13,1,13,9],[14,1,14,9],[1,1,1,4],[2,1,2,4],[3,1,3,4],[4,1,4,4],[11,1,11,9],[12,1,12,9]]}
[]
[null,"Expéditeur ",null,null,null,null,null,null,"Destinataire"]
[null,{"$f":"'Informations oeuvre'!C7","v":"[à compléter]"},null,null,null,null,null,null,{"$f":"N3&\" \"&+VLOOKUP($N$3,'Base de données ayants droit'!B:Y,2,FALSE)","v":"Exemple 2 "},null,null,null,"Ayant droit ","Exemple 2"]
[null,{"$f":"'Informations oeuvre'!C8","v":"[à compléter]"},null,null,null,null,null,null,{"$f":"+VLOOKUP($N$3,'Base de données ayants droit'!B:Y,5,FALSE)","v":"Sunset Boulevard"},null,null,null,"Ne pas modifier cette cellule"]
[null,{"$f":"'Informations oeuvre'!C9","v":"2025-12-31"},null,null,null,null,null,null,{"$f":"+VLOOKUP($N$3,'Base de données ayants droit'!B:Y,6,FALSE)","v":"75009 Paris"}]
[]
[null,{"$f":"'Informations oeuvre'!C2","v":"ŒUVRE"},null,null,null,null,null,{"$f":"\"DÉCOMPTE N°\"&'Informations oeuvre'!C11","v":"DÉCOMPTE N°0"}]
[null,{"$f":"\"Format / Saison : \"&'Informations oeuvre'!C4","v":"Format / Saison : [à compléter]"},null,null,null,null,null,{"$f":"\"Arrété au \"&TEXT('Informations oeuvre'!C10,\"jj/mm/aaaa\")","v":"Arrété au 31.12.2025"}]
[null,{"$f":"\"Réalisation : \"&'Informations oeuvre'!C3","v":"Réalisation : [à compléter]"}]
[null,{"$f":"\"N° ISAN : \"&'Informations oeuvre'!C5","v":"N° ISAN : [à compléter]"}]
[]
[null,{"$f":"+N3&\" \"&VLOOKUP(N3,'Base de données ayants droit'!B:Y,2, FALSE)","v":"Exemple 2 "}]
[null,{"$f":"\"Contrat \"&VLOOKUP(N3,'Base de données ayants droit'!B:Y,3,FALSE)","v":"Contrat Auteur.e scénariste"}]
[null,{"$f":"\"Signé en date du \"&TEXT(VLOOKUP(N3,'Base de données ayants droit'!B:W,11,FALSE),\"jj/mm/aa\")&IF(VLOOKUP(N3,'Base de données ayants droit'!B:W,12,FALSE)=TRUE,\" et son/ses avenant(s)\",\"\")","v":"Signé en date du 18/04/51 et son/ses avenant(s)"}]
[]
[null,null,null,null,null,null,null,"BASE","%","QP"]
[]
[null,"A/ JUSQU’À RECUPERATION DE XX"]
[]
[null,"1/ EXPLOITATION CINEMA France"]
[null,null,"Recette nette part producteur ",null,null,null,null,{"$f":"+J89","v":0},0,{"$f":"+H21*I21","v":0}]
[]
[null,"2/ EXPLOITATION VIDEO France"]
[null,null,"Recette nette part producteur ",null,null,null,null,{"$f":"+J97","v":0},0,{"$f":"+H24*I24","v":0}]
[]
[null,"3/ EXPLOITATION VOD France"]
[null,null,"Recette nette part producteur ",null,null,null,null,{"$f":"+J105","v":0},0,{"$f":"+H27*I27","v":0}]
[]
[null,"4/ EXPLOITATION TV France",null,null,null,null,{"$f":"+IF(VLOOKUP($N$3,'Base de données ayants droit'!B:Y,19,FALSE)=TRUE,\"Gestion collective\",\"\")","v":""}]
[null,null,"Recette nette part producteur ",null,null,null,null,{"$f":"+J113","v":0},0,{"$f":"+H30*I30","v":0}]
[]
[null,"5/ EXPLOITATION SVOD France"]
[null,null,"Recette nette part producteur ",null,null,null,null,{"$f":"+J121","v":0},0,{"$f":"+H33*I33","v":0}]
[]
[null,"6/ AUTRES EXPLOITATIONS France"]
[null,null,"Recette nette part producteur ",null,null,null,null,{"$f":"+J128","v":0},0,{"$f":"H36*I36","v":0}]
[]
[null,"7/ EXPLOITATION VIDEO/VOD/TV/SVOD INTERNATIONALE"]
[null,null,"Recette nette part producteur ",null,null,null,null,{"$f":"+J141","v":0},0,{"$f":"H39*I39","v":0}]
[]
{"$rows_left_out":115}
{"sheet":"Matrice décompte amortissement","index":11,"n_rows":241,"n_cols":14,"rows_kept":241,"cut":false,"hidden":false,"merged":[[12,1,12,9],[1,1,1,4],[2,1,2,4],[3,1,3,4],[4,1,4,4],[11,1,11,9],[109,2,109,5],[13,1,13,9],[14,1,14,9],[81,1,82,6],[85,2,85,5],[86,2,86,6],[91,2,91,5],[92,2,92,6],[97,2,97,5],[98,2,98,6],[103,2,103,5],[104,2,104,6],[128,2,128,6],[110,2,110,6],[115,2,115,5],[116,2,116,6],[121,2,121,5],[122,2,122,6],[127,2,127,5]]}
[]
[null,"Expéditeur ",null,null,null,null,null,null,"Destinataire"]
[null,{"$f":"'Informations oeuvre'!C7","v":"[à compléter]"},null,null,null,null,null,null,{"$f":"N3&\" \"&+VLOOKUP($N$3,'Base de données ayants droit'!B:Y,2,FALSE)","v":"Exemple 2 "},null,null,null,"Ayant droit ","Exemple 2"]
[null,{"$f":"'Informations oeuvre'!C8","v":"[à compléter]"},null,null,null,null,null,null,{"$f":"+VLOOKUP($N$3,'Base de données ayants droit'!B:Y,5,FALSE)","v":"Sunset Boulevard"},null,null,null,"Ne pas modifier cette cellule"]
[null,{"$f":"'Informations oeuvre'!C9","v":"2025-12-31"},null,null,null,null,null,null,{"$f":"+VLOOKUP($N$3,'Base de données ayants droit'!B:Y,6,FALSE)","v":"75009 Paris"}]
[]
[null,{"$f":"'Informations oeuvre'!C2","v":"ŒUVRE"},null,null,null,null,null,{"$f":"\"DÉCOMPTE N°\"&'Informations oeuvre'!C11","v":"DÉCOMPTE N°0"}]
[null,{"$f":"\"Format / Saison : \"&'Informations oeuvre'!C4","v":"Format / Saison : [à compléter]"},null,null,null,null,null,{"$f":"\"Arrété au \"&TEXT('Informations oeuvre'!C10,\"jj/mm/aaaa\")","v":"Arrété au 31.12.2025"}]
[null,{"$f":"\"Réalisation : \"&'Informations oeuvre'!C3","v":"Réalisation : [à compléter]"}]
[null,{"$f":"\"N° ISAN : \"&'Informations oeuvre'!C5","v":"N° ISAN : [à compléter]"}]
[]
[null,{"$f":"+N3&\" \"&VLOOKUP(N3,'Base de données ayants droit'!B:Y,2, FALSE)","v":"Exemple 2 "}]
[null,{"$f":"\"Contrat \"&VLOOKUP(N3,'Base de données ayants droit'!B:Y,3,FALSE)","v":"Contrat Auteur.e scénariste"}]
[null,{"$f":"\"Signé en date du \"&TEXT(VLOOKUP(N3,'Base de données ayants droit'!B:W,11,FALSE),\"jj/mm/aa\")&IF(VLOOKUP(N3,'Base de données ayants droit'!B:W,12,FALSE)=TRUE,\" et son/ses avenant(s)\",\"\")","v":"Signé en date du 18/04/51 et son/ses avenant(s)"}]
[]
[null,{"$f":"F146","v":"ŒUVRE NON AMORTIE"},null,null,null,null,null,"BASE","%","QP"]
[]
[null,"9/ TOUS SUPPORTS "]
[null,null,"Recettes post amortissement",null,null,null,null,{"$f":"J146","v":0},0,{"$f":"H19*I19","v":0}]
[]
[null,"TOTAL",null,null,null,null,null,null,null,{"$f":"SUM(J17:J20)","v":0}]
[]
[null,"TOTAL À VERSER",null,null,null,null,null,null,null,{"$f":"J21","v":0},null,null,"Ne pas modifier le nom de la cellule \"J48\" = \"TAV\""]
[]
[null,"À DÉDUIRE SITUATION PRÉCEDENTE",null,null,null,null,null,null,null,0,null,null,"Ne pas modifier le nom de la cellule \"J50\" = \"ADSP\""]
[]
[null,"À FACTURER H.T. SUR LA PÉRIODE",null,null,null,null,null,null,null,{"$f":"J23+J25","v":0}]
[]
[]
[]
[]
[]
[]
[]
[]
[]
[]
[]
[]
[]
{"$rows_left_out":201}