{"text_format":"1","workbook":"xlsx","n_sheets":12,"sheets":["Tableau de bord","Décompte général","Tutoriel","Ressources",">>>","<<<","Informations film","Base de données ayants droit","Matrice décompte auteur.e","Matrice décompte interpréte","Matrice décompte sofica","Matrice décompte autre AD"],"not_rendered":{"charts":0,"images":10,"macros":1,"external_links":0,"defined_names":25,"comments":0,"pivot_tables":0},"unopened":[],"bounds":{"document_bytes":16777216,"sheet_cells":100000,"rows_first":2000,"rows_last":500,"rows_between":2000,"halvings":0,"cell_chars":16384,"cell_head_chars":4096},"cells_cut":0,"cells_raw":0,"read":"whole","date_system":"1900"}

{"sheet":"Tableau de bord","index":0,"n_rows":19,"n_cols":11,"rows_kept":19,"cut":false,"hidden":false,"merged":[]}
[]
[]
[]
[]
[]
[null,null,null,null,"\n"]
[]
[]
[]
[]
[]
[]
[]
[null,null,null,null,null,null,null,null,null,null,0]
[null,null,null,null,null,null,null,null,null,null,"2023-12-31"]
[]
[]
[]
[null,false]

{"sheet":"Décompte général","index":1,"n_rows":115,"n_cols":14,"rows_kept":115,"cut":false,"hidden":false,"merged":[]}
[]
[]
[]
[]
[]
[null,null,null,null,null,null,null,null,null,null,null,null,"LÉGENDE DES COULEURS DE REMPLISSAGE"]
[null,{"$f":"'Informations film'!C2","v":"FILM"},null,null,null,null,null,null,null,{"$f":"\"Période arrétée au : \"&TEXT('Informations film'!C9,\"jj/mm/aaaa\")","v":"Période arrétée au : 31/12/2023"}]
[null,{"$f":"+'Informations film'!C6","v":"[à compléter]"},null,null,null,null,null,null,null,null,null,null,0,"Variables à compléter à partir des relevés d'exploitation des mandataires, voir la section tutoriel pour plus de détail"]
[null,null,null,null,null,null,null,null,null,null,null,null,null,"Lignes qui concernent les auteur.e.s, voir la section tutoriel pour plus de détail"]
[null,null,null,null,null,null,null,"ANTÉRIEUR","PÉRIODE","CUMUL"]
[null,"1/ EXPLOITATION CINÉMA FRANCE",null,null,null,null,"[DISTRIBUTEUR]",null,null,null,null,null,"COMMENTAIRES"]
[null,null,"Nombre d'entrées encaissées",null,null,null,0]
[null,null,"Prix hors taxes (net de TVA et de TSA) payé par le public ",null,null,null,null,0,{"$f":"J13-H13","v":0},{"$f":"+J15*2","v":0},null,null,"Si l'information n'est pas disponible, le prix payé par le public peut-être calculé sur la base Recette brute distributeur x2"]
[]
[null,null,"Recette brute distributeur secteur commercial",null,null,null,null,0,{"$f":"J15-H15","v":0},0]
[null,null,"Commission de distribution secteur commercial",null,null,null,0.25,0,{"$f":"J16-H16","v":0},{"$f":"J15*-G16","v":0},null,null,"En cas de palier de commission, ajouter les lignes nécessaires et modifier la calcul des RNPP"]
[null,null,"Frais de commercialisation",null,null,null,null,0,0,0,null,null,"Indiquer l'intégralité des frais de commercialisation cinéma (en négatif)"]
[null,null,"Cotisations et taxes",null,null,null,null,0,0,0,null,null,"Indiquer les cotisations et taxes en négatif"]
[null,null,"Recette nette part producteur cinéma France secteur commercial",null,null,null,null,0,{"$f":"J19-H19","v":0},{"$f":"SUM(J15:J18)","v":0}]
[]
[null,null,"Recette brute distributeur secteur non commercial",null,null,null,null,0,{"$f":"J21-H21","v":0},0]
[null,null,"Commission de distribution secteur non commercial",null,null,null,0.3,0,{"$f":"J22-H22","v":0},{"$f":"J21*-G22","v":0}]
[null,null,"Cotisations et taxes",null,null,null,null,0,0,0,null,null,"(en négatif)"]
[null,null,"Recette nette part producteur cinéma France secteur non commercial",null,null,null,null,0,0,{"$f":"SUM(J21:J23)","v":0}]
[]
[null,null,"Minimum garanti",null,null,null,0,0,{"$f":"J26-H26","v":0},{"$f":"+-G26","v":0},null,null,"Le cas échéant, compléter en case G le minimum garanti (en positif)"]
[null,null,"Recette nette part producteur cinéma France (après MG)",null,null,null,null,0,{"$f":"J27-H27","v":0},{"$f":"SUM(J19,J24,J26)","v":0}]
[]
[null,"2/ EXPLOITATION VIDÉO FRANCE",null,null,null,null,"[DISTRIBUTEUR]"]
[null,null,"Chiffre d'affaires brut éditeur HT",null,null,null,null,0,{"$f":"J30-H30","v":0},0]
[null,null,"Coefficient correcteur (multiplicateur) ",null,null,null,1.5,null,null,null,null,null,"A modifier selon la base de calcul indiquée dans le contrat d'auteur"]
[null,null,"Base de répartition auteur",null,null,null,null,0,{"$f":"J32-H32","v":0},{"$f":"J30*G31","v":0},null,null,"A modifier selon la base de calcul indiquée dans le contrat d'auteur"]
[]
[null,null,null,null,null,null,"Nombre vente"]
[null,null,"Chiffre d'affaires net éditeur HT - Vente directe",null,null,null,null,0,{"$f":"J35-H35","v":0},0,null,null,"Nombre de vente à indiquer si information disponible"]
[null,null,"Chiffre d'affaires net éditeur HT - Location",null,null,null,null,0,{"$f":"J36-H36","v":0},0,null,null,"Nombre de vente à indiquer si information disponible"]
[null,null,"Chiffre d'affaires net éditeur HT - Autres circuits",null,null,null,null,0,0,0,null,null,"Nombre de vente à indiquer si information disponible"]
[null,null,"Royalties - Vente directe",null,null,null,0.3,0,0,{"$f":"J35*G38","v":0},null,null,"En cas de commission, modifier la case et le calcul des RNPP Vidéo"]
[null,null,"Royalties - Location",null,null,null,0.3,0,0,{"$f":"J36*G39","v":0}]
[null,null,"Royalties - Autres circuits",null,null,null,0.3,0,0,{"$f":"J37*G40","v":0}]
{"$rows_left_out":76}
{"sheet":"Tutoriel","index":2,"n_rows":56,"n_cols":5,"rows_kept":56,"cut":false,"hidden":false,"merged":[]}
[]
[]
[]
[]
[]
[]
[]
[]
[]
[]
[]
[]
[]
[]
[]
[]
[]
[]
[]
[]
[]
[]
[]
[]
[]
[null,"SOMMAIRE"]
[]
[null,"     AVERTISSEMENT – CONDITIONS D’UTILISATION"]
[null,"     PRÉAMBULE : EXCEL VBA"]
[null,"     ÉTAPE 1 : INFORMATIONS DU FILM"]
[null,"     ÉTAPE 2 : LES AYANTS DROIT"]
[null,null,"2.1 Introduction"]
[null,null,"2.2 Ajouter un ayant droit"]
[null,null,null,"2.2.1 Cadre « Informations »"]
[null,null,null,"2.2.2 Cadre « Quotes-parts de recette »"]
[null,null,null,null,"Auteur.e.s et interprètes"]
[null,null,null,null,"Autres ayants droit"]
[null,null,"2.3 Modifier un ayant droit"]
[null,null,"2.4 Supprimer un ayant droit"]
[null,"     ÉTAPE 3 : LES DÉCOMPTES"]
{"$rows_left_out":17}
{"sheet":"Ressources","index":3,"n_rows":0,"n_cols":0,"rows_kept":0,"cut":false,"hidden":false,"merged":[]}

{"sheet":">>>","index":4,"n_rows":0,"n_cols":0,"rows_kept":0,"cut":false,"hidden":false,"merged":[]}

{"sheet":"<<<","index":5,"n_rows":0,"n_cols":0,"rows_kept":0,"cut":false,"hidden":false,"merged":[]}

{"sheet":"Informations film","index":6,"n_rows":11,"n_cols":3,"rows_kept":11,"cut":false,"hidden":false,"merged":[]}
[]
[null,"Titre du film","FILM"]
[null,"Réalisation","[à compléter]"]
[null,"Sortie","jj/mm/aaaa"]
[null,"N°RCA",123456]
[null,"Production","[à compléter]"]
[null,"Adresse","[à compléter]"]
[null,"CP et ville","[à compléter]"]
[null,"Période",{"$f":"'Tableau de bord'!K15","v":"2023-12-31"}]
[null,null,{"$f":"TEXT(C9,\"j.M.aaaa\")","v":"31.12.2023"}]
[null,"N° Répartition",{"$f":"'Tableau de bord'!K14","v":0}]

{"sheet":"Base de données ayants droit","index":7,"n_rows":42,"n_cols":33,"rows_kept":42,"cut":false,"hidden":false,"merged":[]}
["#","NOM","Prénom","Qualité","Agence artistique","Adresse","Code postal et ville","Mail de contact 1","Mail de contact 2","Mail de contact 3","Mail de contact 4","Contrat signé le ","Avenant(s)","MG/investissement","1/ Cinéma FR Commercial","1/ Cinéma FR Non commercial","2/ Vidéo France","3/ VOD France","4/ TV France","Gestion collective","5/ SVOD France","6/ International","7/ Autres exploitations","8/ Auteur et interprètes post-amortissement",null,"8/ FDS","Après récupération QP commune","Après récupération QP FDS","Identifiant",null,4,"AD3","Ne pas modifier"]
[{"$f":"AC2","v":"AD1"},"EXEMPLE 1",null,"Coproducteur",null,"14 boulevard des Capucines","75009 PARIS","exemple1@mail.com","exemple1@mail.fr","exemple1@mail1.com","exemple1@mail1.fr","28/12/1895",true,50000,1,1,2,3,4,false,5,6,7,null,null,8,9,10,"AD1"]
[{"$f":"AC3","v":"AD2"},"EXEMPLE 2",null,"Auteur.e scénariste","Etoile","Sunset Boulevard","75009 Paris","exemple2@mail.com","exemple2@mail.fr","exemple2@mail2.com","exemple2@mail2.fr","18/04/1951",true,10000,1,1,2,3,4,false,5,6,7,8,null,null,null,null,"AD2"]
[0]
[0]
[0]
[0]
[0]
[0]
[0]
[0]
[0]
[0]
[0]
[0]
[0]
[0]
[0]
[0]
[0]
[0]
[0]
[0]
[0]
[0]
[0]
[0]
[0]
[0]
[0]
[0]
[0]
[0]
[0]
[0]
[0]
[0]
[0]
[0]
[0]
{"$rows_left_out":3}
{"sheet":"Matrice décompte auteur.e","index":8,"n_rows":194,"n_cols":21,"rows_kept":194,"cut":false,"hidden":false,"merged":[[11,1,11,9],[12,1,12,9],[13,1,13,9],[1,1,1,4],[2,1,2,4],[3,1,3,4],[4,1,4,4]]}
[]
[null,"Expéditeur ",null,null,null,null,null,null,"Destinataire"]
[null,{"$f":"'Informations film'!C6","v":"[à compléter]"},null,null,null,null,null,null,{"$f":"N3&\" \"&+VLOOKUP($N$3,'Base de données ayants droit'!B:Y,2,FALSE)","v":"Exemple 2 "},null,null,null,"Ayant droit ","Exemple 2"]
[null,{"$f":"'Informations film'!C7","v":"[à compléter]"},null,null,null,null,null,null,{"$f":"+VLOOKUP($N$3,'Base de données ayants droit'!B:Y,5,FALSE)","v":"Sunset Boulevard"},null,null,null,"Ne pas modifier cette cellule"]
[null,{"$f":"'Informations film'!C8","v":"[à compléter]"},null,null,null,null,null,null,{"$f":"+VLOOKUP($N$3,'Base de données ayants droit'!B:Y,6,FALSE)","v":"75009 Paris"}]
[]
[null,{"$f":"'Informations film'!C2","v":"FILM"},null,null,null,null,null,{"$f":"\"DÉCOMPTE N°\"&'Informations film'!C11","v":"DÉCOMPTE N°0"}]
[null,{"$f":"\"Sortie France : \"&'Informations film'!C4","v":"Sortie France : jj/mm/aaaa"},null,null,null,null,null,{"$f":"\"Arrété au \"&TEXT('Informations film'!C9,\"jj/mm/aaaa\")","v":"Arrété au 31/12/2023"}]
[null,{"$f":"\"Réalisation : \"&'Informations film'!C3","v":"Réalisation : [à compléter]"}]
[null,{"$f":"\"N° RCA : \"&'Informations film'!C5","v":"N° RCA : 123456"}]
[]
[null,{"$f":"+N3&\" \"&VLOOKUP(N3,'Base de données ayants droit'!B:Y,2, FALSE)","v":"Exemple 2 "}]
[null,{"$f":"\"Contrat \"&VLOOKUP(N3,'Base de données ayants droit'!B:Y,3,FALSE)","v":"Contrat Auteur.e scénariste"}]
[null,{"$f":"\"Signé en date du \"&TEXT(VLOOKUP(N3,'Base de données ayants droit'!B:W,11,FALSE),\"jj/mm/aa\")&IF(VLOOKUP(N3,'Base de données ayants droit'!B:W,12,FALSE)=TRUE,\" et son/ses avenant(s)\",\"\")","v":"Signé en date du 18/04/51 et son/ses avenant(s)"}]
[]
[null,"RÉMUNÉRATION PROPORTIONNELLE",null,null,null,null,null,"BASE","%","QP"]
[]
[null,"1/ EXPLOITATION CINEMA France"]
[null,null,"Secteur commercial - Prix payé par le public net de TVA et TSA",null,null,null,null,{"$f":"J88","v":0},{"$f":"+VLOOKUP($N$3,'Base de données ayants droit'!B:Y,14,FALSE)&\"%\"","v":"1%"},{"$f":"H19*I19","v":0}]
[null,null,"Secteur non commercial - Recette nette part producteur",null,null,null,null,{"$f":"J99","v":0},{"$f":"+VLOOKUP($N$3,'Base de données ayants droit'!B:Y,15,FALSE)&\"%\"","v":"1%"},{"$f":"H20*I20","v":0}]
[]
[null,"2/ EXPLOITATION VIDEO France"]
[null,null,"CA brut éditeur majoré d'un coefficient correcteur ",null,null,null,null,{"$f":"IF(J107>0,J107,0)","v":0},{"$f":"+VLOOKUP($N$3,'Base de données ayants droit'!B:Y,16,FALSE)&\"%\"","v":"2%"},{"$f":"H23*I23","v":0},null,null,"Le cas échéant, modifier les bases de recette pour correspondre aux contrats d'auteur.e et au décompte général"]
[]
[null,"3/ EXPLOITATION VOD France"]
[null,null,"Recette nette part producteur (y.c. MG eventuel)",null,null,null,null,{"$f":"IF(J133>0,J133+G132,G132)","v":0},{"$f":"+VLOOKUP($N$3,'Base de données ayants droit'!B:Y,17,FALSE)&\"%\"","v":"3%"},{"$f":"H26*I26","v":0}]
[]
[null,"4/ EXPLOITATION TV France",null,null,null,null,{"$f":"+IF(VLOOKUP($N$3,'Base de données ayants droit'!B:Y,19,FALSE)=TRUE,\"Gestion collective\",\"\")","v":""}]
[null,null,"Recette nette part producteur (y.c. prévente.s eventuelle.s)",null,null,null,null,{"$f":"(IF(J147>0,J147,0))+J137","v":0},{"$f":"IF(G28=\"Gestion collective\",0,+VLOOKUP($N$3,'Base de données ayants droit'!B:Y,18,FALSE)&\"%\")","v":"4%"},{"$f":"H29*I29","v":0}]
[]
[null,"5/ EXPLOITATION SVOD France"]
[null,null,"Recette nette part producteur (y.c. prévente.s eventuelle.s)",null,null,null,null,{"$f":"(IF(J158>0,J158,0))+J151","v":0},{"$f":"+VLOOKUP($N$3,'Base de données ayants droit'!B:Y,20,FALSE)&\"%\"","v":"5%"},{"$f":"H32*I32","v":0}]
[]
[null,"6/ EXPLOITATION INTERNATIONALE"]
[null,null,"Recette nette part producteur forfaitaire en cas de coproduction franco-étrangère",null,null,null,null,{"$f":"J175","v":0},{"$f":"+VLOOKUP($N$3,'Base de données ayants droit'!B:Y,21,FALSE)&\"%\"","v":"6%"},{"$f":"H35*I35","v":0}]
[null,null,"Recette nette part producteur (y.c. MG eventuel)",null,null,null,null,{"$f":"IF(J173>0,J173+G172,G172)","v":0},{"$f":"+VLOOKUP($N$3,'Base de données ayants droit'!B:Y,21,FALSE)&\"%\"","v":"6%"},{"$f":"H36*I36","v":0},null,null,"En cas de coproduction franco-étrangére, le montant de la participation du coproducteur est à considérer comme une RNPP forfaitaire"]
[]
[null,"7/ AUTRES EXPLOITATIONS"]
[null,null,"Recette nette part producteur",null,null,null,null,{"$f":"IF(J181>0,J181,0)","v":0},{"$f":"+VLOOKUP($N$3,'Base de données ayants droit'!B:Y,22,FALSE)&\"%\"","v":"7%"},{"$f":"H39*I39","v":0}]
[]
{"$rows_left_out":155}
{"sheet":"Matrice décompte interpréte","index":9,"n_rows":185,"n_cols":21,"rows_kept":185,"cut":false,"hidden":false,"merged":[[11,1,11,9],[12,1,12,9],[13,1,13,9],[1,1,1,4],[2,1,2,4],[3,1,3,4],[4,1,4,4]]}
[]
[null,"Expéditeur ",null,null,null,null,null,null,"Destinataire"]
[null,{"$f":"'Informations film'!C6","v":"[à compléter]"},null,null,null,null,null,null,{"$f":"N3&\" \"&+VLOOKUP($N$3,'Base de données ayants droit'!B:Y,2,FALSE)","v":{"$error":"#N/A"}},null,null,null,"Ayant droit "]
[null,{"$f":"'Informations film'!C7","v":"[à compléter]"},null,null,null,null,null,null,{"$f":"+VLOOKUP($N$3,'Base de données ayants droit'!B:Y,5,FALSE)","v":{"$error":"#N/A"}},null,null,null,"Ne pas modifier cette cellule"]
[null,{"$f":"'Informations film'!C8","v":"[à compléter]"},null,null,null,null,null,null,{"$f":"+VLOOKUP($N$3,'Base de données ayants droit'!B:Y,6,FALSE)","v":{"$error":"#N/A"}}]
[]
[null,{"$f":"'Informations film'!C2","v":"FILM"},null,null,null,null,null,{"$f":"\"DÉCOMPTE N°\"&'Informations film'!C11","v":"DÉCOMPTE N°0"}]
[null,{"$f":"\"Sortie France : \"&'Informations film'!C4","v":"Sortie France : jj/mm/aaaa"},null,null,null,null,null,{"$f":"\"Arrété au \"&TEXT('Informations film'!C9,\"jj/mm/aaaa\")","v":"Arrété au 31/12/2023"}]
[null,{"$f":"\"Réalisation : \"&'Informations film'!C3","v":"Réalisation : [à compléter]"}]
[null,{"$f":"\"N° RCA : \"&'Informations film'!C5","v":"N° RCA : 123456"}]
[]
[null,{"$f":"+N3&\" \"&VLOOKUP(N3,'Base de données ayants droit'!B:Y,2, FALSE)","v":{"$error":"#N/A"}}]
[null,{"$f":"\"Contrat \"&VLOOKUP(N3,'Base de données ayants droit'!B:Y,3,FALSE)","v":{"$error":"#N/A"}}]
[null,{"$f":"\"Signé en date du \"&TEXT(VLOOKUP(N3,'Base de données ayants droit'!B:W,11,FALSE),\"jj/mm/aa\")&IF(VLOOKUP(N3,'Base de données ayants droit'!B:W,12,FALSE)=TRUE,\" et son/ses avenant(s)\",\"\")","v":{"$error":"#N/A"}}]
[]
[null,"REDEVANCE",null,null,null,null,null,"BASE","%","QP"]
[]
[null,"1/ EXPLOITATION CINEMA France"]
[null,null,"Recettes nette part producteur  (y.c. MG éventuel)",null,null,null,null,{"$f":"IF(J101>0,J101+G100,G100)","v":0},{"$f":"+VLOOKUP($N$3,'Base de données ayants droit'!B:Y,14,FALSE)&\"%\"","v":{"$error":"#N/A"}},{"$f":"H19*I19","v":{"$error":"#N/A"}}]
[]
[null,"2/ EXPLOITATION VIDEO France"]
[null,null,"Recettes nette part producteur (y.c. MG éventuel)",null,null,null,null,{"$f":"IF(J115>0,J115+G114,G114)","v":0},{"$f":"+VLOOKUP($N$3,'Base de données ayants droit'!B:Y,16,FALSE)&\"%\"","v":{"$error":"#N/A"}},{"$f":"H22*I22","v":{"$error":"#N/A"}}]
[]
[null,"3/ EXPLOITATION VOD France"]
[null,null,"Recette nette part producteur (y.c. MG éventuel)",null,null,null,null,{"$f":"IF(J126>0,J126+G125,G125)","v":0},{"$f":"+VLOOKUP($N$3,'Base de données ayants droit'!B:Y,17,FALSE)&\"%\"","v":{"$error":"#N/A"}},{"$f":"H25*I25","v":{"$error":"#N/A"}}]
[]
[null,"4/ EXPLOITATION TV France",null,null,null,null,{"$f":"+IF(VLOOKUP($N$3,'Base de données ayants droit'!B:Y,19,FALSE)=TRUE,\"Gestion collective\",\"\")","v":{"$error":"#N/A"}}]
[null,null,"Recette nette part producteur (y.c. prévente.s eventuelle.s)",null,null,null,null,{"$f":"(IF(J140>0,J140,0))+J130","v":0},{"$f":"IF(G27=\"Gestion collective\",0,+VLOOKUP($N$3,'Base de données ayants droit'!B:Y,18,FALSE)&\"%\")","v":{"$error":"#N/A"}},{"$f":"H28*I28","v":{"$error":"#N/A"}}]
[]
[null,"5/ EXPLOITATION SVOD France"]
[null,null,"Recette nette part producteur (y.c. prévente.s eventuelle.s)",null,null,null,null,{"$f":"(IF(J151>0,J151,0))+J144","v":0},{"$f":"+VLOOKUP($N$3,'Base de données ayants droit'!B:Y,20,FALSE)&\"%\"","v":{"$error":"#N/A"}},{"$f":"H31*I31","v":{"$error":"#N/A"}}]
[]
[null,"6/ EXPLOITATION INTERNATIONALE"]
[null,null,"Recette nette part producteur forfaitaire en cas de coproduction franco-étrangère",null,null,null,null,{"$f":"J162","v":0},{"$f":"+VLOOKUP($N$3,'Base de données ayants droit'!B:Y,21,FALSE)&\"%\"","v":{"$error":"#N/A"}},{"$f":"H34*I34","v":{"$error":"#N/A"}}]
[null,null,"Recette nette part producteur (y.c. MG éventuel)",null,null,null,null,{"$f":"IF(J160>0,J160+G159,G159)","v":0},{"$f":"+VLOOKUP($N$3,'Base de données ayants droit'!B:Y,21,FALSE)&\"%\"","v":{"$error":"#N/A"}},{"$f":"H35*I35","v":{"$error":"#N/A"}},null,null,"En cas de coproduction franco-étrangére, le montant de la participation du coproducteur est à considérer comme une RNPP forfaitaire"]
[null,null,null,null,null,null,null,null,null,null,null,null,"Dans ce cas, la part de recette du coproducteur étranger est à déduire des RNPP-A sur l'international"]
[null,"7/ AUTRES EXPLOITATIONS"]
[null,null,"Recette nette part producteur",null,null,null,null,{"$f":"+'Décompte général'!J97","v":0},{"$f":"+VLOOKUP($N$3,'Base de données ayants droit'!B:Y,22,FALSE)&\"%\"","v":{"$error":"#N/A"}},{"$f":"H38*I38","v":{"$error":"#N/A"}}]
[]
[null,"AVANCE/MINIMUM GARANTI",null,null,null,null,null,null,null,{"$f":"-(+VLOOKUP($N$3,'Base de données ayants droit'!B:Y,13,FALSE))","v":{"$error":"#N/A"}}]
{"$rows_left_out":146}
{"sheet":"Matrice décompte sofica","index":10,"n_rows":160,"n_cols":14,"rows_kept":160,"cut":false,"hidden":false,"merged":[[13,1,13,9],[1,1,1,4],[2,1,2,4],[3,1,3,4],[4,1,4,4],[11,1,11,9],[12,1,12,9]]}
[]
[null,"Expéditeur ",null,null,null,null,null,null,"Destinataire"]
[null,{"$f":"'Informations film'!C6","v":"[à compléter]"},null,null,null,null,null,null,{"$f":"N3&\" \"&+VLOOKUP($N$3,'Base de données ayants droit'!B:Y,2,FALSE)","v":"EXEMPLE 1 "},null,null,null,"Ayant droit ","EXEMPLE 1"]
[null,{"$f":"'Informations film'!C7","v":"[à compléter]"},null,null,null,null,null,null,{"$f":"+VLOOKUP($N$3,'Base de données ayants droit'!B:Y,5,FALSE)","v":"14 boulevard des Capucines"},null,null,null,"Ne pas modifier cette cellule"]
[null,{"$f":"'Informations film'!C8","v":"[à compléter]"},null,null,null,null,null,null,{"$f":"+VLOOKUP($N$3,'Base de données ayants droit'!B:Y,6,FALSE)","v":"75009 PARIS"}]
[]
[null,{"$f":"'Informations film'!C2","v":"FILM"},null,null,null,null,null,{"$f":"\"DÉCOMPTE N°\"&'Informations film'!C11","v":"DÉCOMPTE N°0"}]
[null,{"$f":"\"Sortie France : \"&'Informations film'!C4","v":"Sortie France : jj/mm/aaaa"},null,null,null,null,null,{"$f":"\"Arrété au \"&TEXT('Informations film'!C9,\"jj/mm/aaaa\")","v":"Arrété au 31/12/2023"}]
[null,{"$f":"\"Réalisation : \"&'Informations film'!C3","v":"Réalisation : [à compléter]"}]
[null,{"$f":"\"N° RCA : \"&'Informations film'!C5","v":"N° RCA : 123456"}]
[]
[null,{"$f":"+N3&\" \"&VLOOKUP(N3,'Base de données ayants droit'!B:Y,2,FALSE)","v":"EXEMPLE 1 "}]
[null,{"$f":"\"Contrat \"&VLOOKUP(N3,'Base de données ayants droit'!B:Y,3,FALSE)","v":"Contrat Coproducteur"}]
[null,{"$f":"\"Signé en date du \"&TEXT(VLOOKUP(N3,'Base de données ayants droit'!B:W,11,FALSE),\"jj/mm/aa\")&IF(VLOOKUP(N3,'Base de données ayants droit'!B:W,12,FALSE)=TRUE,\" et son/ses avenant(s)\",\"\")","v":"Signé en date du 28/12/1895 et son/ses avenant(s)"}]
[]
[null,null,null,null,null,null,null,"BASE","%","QP"]
[]
[null,{"$f":"+\"A/ JUSQU’À RECUPERATION DE \"&TEXT((VLOOKUP(N3,'Base de données ayants droit'!B:Y,13,FALSE)),\"# ##0€\")","v":"A/ JUSQU’À RECUPERATION DE 50 000€"},null,null,null,null,null,null,null,null,null,null,"Ligne à supprimer si pas de palier dans les droits à recette"]
[]
[null,"1/ EXPLOITATION CINEMA France"]
[null,null,"Recettes nette part producteur",null,null,null,null,{"$f":"IF(J99>0,J99,0)","v":0},{"$f":"+VLOOKUP($N$3,'Base de données ayants droit'!B:Y,14,FALSE)&\"%\"","v":"1%"},{"$f":"H21*I21","v":0}]
[]
[null,"2/ EXPLOITATION VIDEO France"]
[null,null,"Recettes nette part producteur",null,null,null,null,{"$f":"IF(J113>0,J113,0)","v":0},{"$f":"+VLOOKUP($N$3,'Base de données ayants droit'!B:Y,16,FALSE)&\"%\"","v":"2%"},{"$f":"H24*I24","v":0}]
[]
[null,"3/ EXPLOITATION VOD France"]
[null,null,"Recette nette part producteur",null,null,null,null,{"$f":"IF(J124>0,J124,0)","v":0},{"$f":"+VLOOKUP($N$3,'Base de données ayants droit'!B:Y,17,FALSE)&\"%\"","v":"3%"},{"$f":"H27*I27","v":0}]
[]
[null,"4/ EXPLOITATION TV France"]
[null,null,"Recette nette part producteur ",null,null,null,null,{"$f":"IF(J135>0,J135,0)","v":0},{"$f":"+VLOOKUP($N$3,'Base de données ayants droit'!B:Y,18,FALSE)&\"%\"","v":"4%"},{"$f":"H30*I30","v":0}]
[]
[null,"5/ EXPLOITATION SVOD France"]
[null,null,"Recette nette part producteur ",null,null,null,null,{"$f":"IF(J143>0,J143,0)","v":0},{"$f":"+VLOOKUP($N$3,'Base de données ayants droit'!B:Y,20,FALSE)&\"%\"","v":"5%"},{"$f":"H33*I33","v":0}]
[]
[null,"6/ EXPLOITATION INTERNATIONALE"]
[null,null,"Recette nette part producteur ",null,null,null,null,{"$f":"IF(J151>0,J151,0)","v":0},{"$f":"+VLOOKUP($N$3,'Base de données ayants droit'!B:Y,21,FALSE)&\"%\"","v":"6%"},{"$f":"H36*I36","v":0}]
[]
[null,"7/ AUTRES EXPLOITATIONS"]
[null,null,"Recette nette part producteur",null,null,null,null,{"$f":"IF(J157>0,J157,0)","v":0},{"$f":"+VLOOKUP($N$3,'Base de données ayants droit'!B:Y,22,FALSE)&\"%\"","v":"7%"},{"$f":"H39*I39","v":0}]
[]
{"$rows_left_out":121}
{"sheet":"Matrice décompte autre AD","index":11,"n_rows":166,"n_cols":14,"rows_kept":166,"cut":false,"hidden":false,"merged":[[13,1,13,9],[1,1,1,4],[2,1,2,4],[3,1,3,4],[4,1,4,4],[11,1,11,9],[12,1,12,9]]}
[]
[null,"Expéditeur ",null,null,null,null,null,null,"Destinataire"]
[null,{"$f":"'Informations film'!C6","v":"[à compléter]"},null,null,null,null,null,null,{"$f":"N3&\" \"&+VLOOKUP($N$3,'Base de données ayants droit'!B:Y,2,FALSE)","v":"EXEMPLE 1 "},null,null,null,"Ayant droit ","EXEMPLE 1"]
[null,{"$f":"'Informations film'!C7","v":"[à compléter]"},null,null,null,null,null,null,{"$f":"+VLOOKUP($N$3,'Base de données ayants droit'!B:Y,5,FALSE)","v":"14 boulevard des Capucines"},null,null,null,"Ne pas modifier cette cellule"]
[null,{"$f":"'Informations film'!C8","v":"[à compléter]"},null,null,null,null,null,null,{"$f":"+VLOOKUP($N$3,'Base de données ayants droit'!B:Y,6,FALSE)","v":"75009 PARIS"}]
[]
[null,{"$f":"'Informations film'!C2","v":"FILM"},null,null,null,null,null,{"$f":"\"DÉCOMPTE N°\"&'Informations film'!C11","v":"DÉCOMPTE N°0"}]
[null,{"$f":"\"Sortie France : \"&'Informations film'!C4","v":"Sortie France : jj/mm/aaaa"},null,null,null,null,null,{"$f":"\"Arrété au \"&TEXT('Informations film'!C9,\"jj/mm/aaaa\")","v":"Arrété au 31/12/2023"}]
[null,{"$f":"\"Réalisation : \"&'Informations film'!C3","v":"Réalisation : [à compléter]"}]
[null,{"$f":"\"N° RCA : \"&'Informations film'!C5","v":"N° RCA : 123456"}]
[]
[null,{"$f":"+N3&\" \"&VLOOKUP(N3,'Base de données ayants droit'!B:Y,2,FALSE)","v":"EXEMPLE 1 "}]
[null,{"$f":"\"Contrat \"&VLOOKUP(N3,'Base de données ayants droit'!B:Y,3,FALSE)","v":"Contrat Coproducteur"}]
[null,{"$f":"\"Signé en date du \"&TEXT(VLOOKUP(N3,'Base de données ayants droit'!B:W,11,FALSE),\"jj/mm/aa\")&IF(VLOOKUP(N3,'Base de données ayants droit'!B:W,12,FALSE)=TRUE,\" et son/ses avenant(s)\",\"\")","v":"Signé en date du 28/12/1895 et son/ses avenant(s)"}]
[]
[null,null,null,null,null,null,null,"BASE","%","QP"]
[]
[null,{"$f":"+\"A/ JUSQU’À RECUPERATION DE \"&TEXT((VLOOKUP(N3,'Base de données ayants droit'!B:Y,13,FALSE)),\"# ##0€\")","v":"A/ JUSQU’À RECUPERATION DE 50 000€"},null,null,null,null,null,null,null,null,null,null,"Ligne à supprimier si pas de palier dans les droits à recette"]
[]
[null,"1/ EXPLOITATION CINEMA France"]
[null,null,"Recettes nette part producteur",null,null,null,null,{"$f":"IF(J100>0,J100,0)","v":0},{"$f":"+VLOOKUP($N$3,'Base de données ayants droit'!B:Y,14,FALSE)&\"%\"","v":"1%"},{"$f":"H21*I21","v":0}]
[]
[null,"2/ EXPLOITATION VIDEO France"]
[null,null,"Recettes nette part producteur",null,null,null,null,{"$f":"IF(J114>0,J114,0)","v":0},{"$f":"+VLOOKUP($N$3,'Base de données ayants droit'!B:Y,16,FALSE)&\"%\"","v":"2%"},{"$f":"H24*I24","v":0}]
[]
[null,"3/ EXPLOITATION VOD France"]
[null,null,"Recette nette part producteur",null,null,null,null,{"$f":"IF(J125>0,J157,0)","v":0},{"$f":"+VLOOKUP($N$3,'Base de données ayants droit'!B:Y,17,FALSE)&\"%\"","v":"3%"},{"$f":"H27*I27","v":0}]
[]
[null,"4/ EXPLOITATION TV France"]
[null,null,"Recette nette part producteur ",null,null,null,null,{"$f":"IF(J136>0,J136,0)","v":0},{"$f":"+VLOOKUP($N$3,'Base de données ayants droit'!B:Y,18,FALSE)&\"%\"","v":"4%"},{"$f":"H30*I30","v":0}]
[]
[null,"5/ EXPLOITATION SVOD France"]
[null,null,"Recette nette part producteur ",null,null,null,null,{"$f":"IF(J144>0,J144,0)","v":0},{"$f":"+VLOOKUP($N$3,'Base de données ayants droit'!B:Y,20,FALSE)&\"%\"","v":"5%"},{"$f":"H33*I33","v":0}]
[]
[null,"6/ EXPLOITATION INTERNATIONALE"]
[null,null,"Recette nette part producteur ",null,null,null,null,{"$f":"IF(J152>0,J152,0)","v":0},{"$f":"+VLOOKUP($N$3,'Base de données ayants droit'!B:Y,21,FALSE)&\"%\"","v":"6%"},{"$f":"H36*I36","v":0}]
[]
[null,"7/ AUTRES EXPLOITATIONS"]
[null,null,"Recette nette part producteur",null,null,null,null,{"$f":"IF(J158>0,J158,0)","v":0},{"$f":"+VLOOKUP($N$3,'Base de données ayants droit'!B:Y,22,FALSE)&\"%\"","v":"7%"},{"$f":"H39*I39","v":0}]
[]
{"$rows_left_out":126}